node.js – gyp ERR node-sass

I have been trying for days to fix this when doing npm install. Tried everything online cannot find out why

npm ERR! code 1
npm ERR! path C:snode_modulesnode-sass
npm ERR! command failed
npm ERR! command C:Windowssystem32cmd.exe /d /s /c node scripts/build.js
npm ERR! Building: C:Program Filesnodejsnode.exe C:snode_modulesnode-gypbinnode-gyp.js rebuild --verbose --libsass_ext= --libsass_cflags= --libsass_ldflags= --libsass_library=
npm ERR! gyp info it worked if it ends with ok
npm ERR! gyp verb cli [
npm ERR! gyp verb cli   'C:\Program Files\nodejs\node.exe',
npm ERR! gyp verb cli   'C:\s\node_modules\node-gyp\bin\node-gyp.js',
npm ERR! gyp verb cli   'rebuild',
npm ERR! gyp verb cli   '--verbose',
npm ERR! gyp verb cli   '--libsass_ext=",
npm ERR! gyp verb cli   "--libsass_cflags=",
npm ERR! gyp verb cli   "--libsass_ldflags=",
npm ERR! gyp verb cli   "--libsass_library='
npm ERR! gyp verb cli ]
npm ERR! gyp info using node-gyp@3.8.0
npm ERR! gyp info using node@16.15.0 | win32 | x64
npm ERR! gyp verb command rebuild []
npm ERR! gyp verb command clean []
npm ERR! gyp verb clean removing "build" directory
npm ERR! gyp verb command configure []
npm ERR! gyp verb check python checking for Python executable "C:Python27python.exe" in the PATH
npm ERR! gyp verb `which` succeeded C:Python27python.exe C:Python27python.exe
npm ERR! gyp verb check python version `C:Python27python.exe -c "import sys; print "2.7.6
npm ERR! gyp verb check python version .%s.%s" % sys.version_info[:3];"` returned: %j
npm ERR! gyp verb get node dir no --target version specified, falling back to host node version: 16.15.0
npm ERR! gyp verb command install [ '16.15.0' ]
npm ERR! gyp verb install input version string "16.15.0"
npm ERR! gyp verb install installing version: 16.15.0
npm ERR! gyp verb install --ensure was passed, so won't reinstall if already installed
npm ERR! gyp verb install version is already installed, need to check "installVersion"
npm ERR! gyp verb got "installVersion" 9
npm ERR! gyp verb needs "installVersion" 9
npm ERR! gyp verb install version is good
npm ERR! gyp verb get node dir target node version installed: 16.15.0
npm ERR! gyp verb build dir attempting to create "build" dir: C:snode_modulesnode-sassbuild
npm ERR! gyp verb build dir "build" dir needed to be created? C:snode_modulesnode-sassbuild
npm ERR! gyp verb build/config.gypi creating config file
npm ERR! gyp verb build/config.gypi writing out config file: C:snode_modulesnode-sassbuildconfig.gypi
npm ERR! (node:73332) [DEP0150] DeprecationWarning: Setting process.config is deprecated. In the future the property will be read-only.
npm ERR! (Use `node --trace-deprecation ...` to show where the warning was created)
npm ERR! gyp verb config.gypi checking for gypi file: C:snode_modulesnode-sassconfig.gypi
npm ERR! gyp verb common.gypi checking for gypi file: C:snode_modulesnode-sasscommon.gypi
npm ERR! gyp verb gyp gyp format was not specified; forcing "msvs"
npm ERR! gyp info spawn C:Python27python.exe
npm ERR! gyp info spawn args [
npm ERR! gyp info spawn args   'C:\s\node_modules\node-gyp\gyp\gyp_main.py',
npm ERR! gyp info spawn args   'binding.gyp',
npm ERR! gyp info spawn args   '-f',
npm ERR! gyp info spawn args   'msvs',
npm ERR! gyp info spawn args   '-G',
npm ERR! gyp info spawn args   'msvs_version=2022',
npm ERR! gyp info spawn args   '-I',
npm ERR! gyp info spawn args   'C:\s\node_modules\node-sass\build\config.gypi',
npm ERR! gyp info spawn args   '-I',
npm ERR! gyp info spawn args   'C:\s\node_modules\node-gyp\addon.gypi',
npm ERR! gyp info spawn args   '-I',
npm ERR! gyp info spawn args   "C:\Users\'\.node-gyp\16.15.0\include\node\common.gypi",
npm ERR! gyp info spawn args   '-Dlibrary=shared_library',
npm ERR! gyp info spawn args   '-Dvisibility=default',
npm ERR! gyp info spawn args   "-Dnode_root_dir=C:\Users\'\.node-gyp\16.15.0",
npm ERR! gyp info spawn args   '-Dnode_gyp_dir=C:\s\node_modules\node-gyp',
npm ERR! gyp info spawn args   "-Dnode_lib_file=C:\Users\'\.node-gyp\16.15.0\<(target_arch)\node.lib",
npm ERR! gyp info spawn args   '-Dmodule_root_dir=C:\s\node_modules\node-sass',
npm ERR! gyp info spawn args   '-Dnode_engine=v8',
npm ERR! gyp info spawn args   '--depth=.',
npm ERR! gyp info spawn args   '--no-parallel',
npm ERR! gyp info spawn args   '--generator-output',
npm ERR! gyp info spawn args   'C:\s\node_modules\node-sass\build',
npm ERR! gyp info spawn args   '-Goutput_dir=.'
npm ERR! gyp info spawn args ]
npm ERR! Traceback (most recent call last):
npm ERR!   File "C:snode_modulesnode-gypgypgyp_main.py", line 16, in <module>
npm ERR!     sys.exit(gyp.script_main())
npm ERR!   File "C:snode_modulesnode-gypgyppylibgyp__init__.py", line 545, in script_main
npm ERR!     return main(sys.argv[1:])
npm ERR!   File "C:snode_modulesnode-gypgyppylibgyp__init__.py", line 538, in main
npm ERR!     return gyp_main(args)
npm ERR!   File "C:snode_modulesnode-gypgyppylibgyp__init__.py", line 514, in gyp_main
npm ERR!     options.duplicate_basename_check)
npm ERR!   File "C:snode_modulesnode-gypgyppylibgyp__init__.py", line 98, in Load
npm ERR!     generator.CalculateVariables(default_variables, params)
npm ERR!   File "C:snode_modulesnode-gypgyppylibgypgeneratormsvs.py", line 1916, in CalculateVariables
npm ERR!     generator_flags.get('msvs_version', 'auto'))
npm ERR!   File "C:snode_modulesnode-gypgyppylibgypMSVSVersion.py", line 434, in SelectVisualStudioVersion
npm ERR!     versions = _DetectVisualStudioVersions(version_map[version], 'e' in version)
npm ERR! KeyError: '2022'
npm ERR! gyp ERR! configure error
npm ERR! gyp ERR! stack Error: `gyp` failed with exit code: 1
npm ERR! gyp ERR! stack     at ChildProcess.onCpExit (C:snode_modulesnode-gyplibconfigure.js:345:16)
npm ERR! gyp ERR! stack     at ChildProcess.emit (node:events:527:28)
npm ERR! gyp ERR! stack     at Process.ChildProcess._handle.onexit (node:internal/child_process:291:12)
npm ERR! gyp ERR! System Windows_NT 10.0.19042
npm ERR! gyp ERR! command "C:\Program Files\nodejs\node.exe" "C:\s\node_modules\node-gyp\bin\node-gyp.js" "rebuild" "--verbose" "--libsass_ext=" "--libsass_cflags=" "--libsass_ldflags=" "--libsass_library="
npm ERR! gyp ERR! cwd C:snode_modulesnode-sass
npm ERR! gyp ERR! node -v v16.15.0
npm ERR! gyp ERR! node-gyp -v v3.8.0
npm ERR! gyp ERR! not ok
npm ERR! Build failed with error code: 1

npm ERR! A complete log of this run can be found in:
npm ERR!     C:Users'AppDataLocalnpm-cache_logs2022-05-14T01_18_19_677Z-debug-0.log

Leave a Comment